Target
Integrin alpha-4
Ligand
BDBM41587
Substrate
Meas. Tech.
Dose Response of primary screening hit compounds for Identification of VLA-4 Allosteric Modulators
EC50
6710±n/a nM
Citation
 PubChem, PC Dose Response of primary screening hit compounds for Identification of VLA-4 Allosteric Modulators PubChem Bioassay (2010)[AID] 
Target
Name:
Integrin alpha-4
Synonyms:
CD49 antigen-like family member D CD49d antigen ITA4_HUMAN Integrin alpha-4 Integrin alpha-IV VLA-4 integrin alpha 4 precursor | integrin alpha-4 precursor
Type:
Membrane Protein
Mol. Mass.:
114897.35
Organism:
Homo sapiens (Human)
Description:
P13612
Residue:
1032
  
Inhibitor
Name:
BDBM41587
Synonyms:
2'-(4-chlorophenyl)-1'-cyano-4'-spiro[fluorene-9,3'-pyrazolidine]carboxylic acid methyl ester MLS000549147 cid_3609942 methyl 2'-(4-chlorophenyl)-1'-cyano-spiro[fluorene-9,3'-pyrazolidine]-4'-carboxylate | methyl 2'-(4-chlorophenyl)-1'-cyanospiro[fluorene-9,3'-pyrazolidine]-4'-carboxylate
Type:
Small organic molecule
Emp. Form.:
C24H18ClN3O2
Mol. Mass.:
415.872
SMILES:
COC(=O)C1CN(C#N)N(c2ccc(Cl)cc2)C11c2ccccc2-c2ccccc12
: