Target
Nuclear receptor subfamily 1 group I member 2
Ligand
BDBM75446
Substrate
Meas. Tech.
Luminescence-based counterscreen for activators of the Aryl Hydrocarbon Receptor (AHR): cell-based high throughput dose response screening assay for activators of the Pregnane X Receptor (PXR)
EC50
>116193±n/a nM
Citation
 PubChem, PC Luminescence-based counterscreen for activators of the Aryl Hydrocarbon Receptor (AHR): cell-based high throughput dose response screening assay for activators of the Pregnane X Receptor (PXR) PubChem Bioassay (2010)[AID] 
Target
Name:
Nuclear receptor subfamily 1 group I member 2
Synonyms:
NR1I2 Orphan nuclear receptor PAR1 PXR SXR nuclear receptor subfamily 1 group I member 2 isoform 1
Type:
Nuclear receptor
Mol. Mass.:
49774.77
Organism:
Homo sapiens (Human)
Description:
O75469
Residue:
434
  
Inhibitor
Name:
BDBM75446
Synonyms:
2-Methoxy-N-(5-thiophen-2-yl-[1,3,4]thiadiazol-2-yl)-acetamide 2-methoxy-N-(5-thiophen-2-yl-1,3,4-thiadiazol-2-yl)ethanamide MLS000034756 cid_649189
Type:
Small organic molecule
Emp. Form.:
C9H9N3O2S2
Mol. Mass.:
255.317
SMILES:
COCC(=O)Nc1nnc(s1)-c1cccs1
: