Target
Nuclear receptor subfamily 1 group I member 2
Ligand
BDBM38363
Substrate
Meas. Tech.
Luminescence-based counterscreen for activators of the Aryl Hydrocarbon Receptor (AHR): cell-based high throughput dose response screening assay for activators of the Pregnane X Receptor (PXR)
EC50
>116135±n/a nM
Citation
 PubChem, PC Luminescence-based counterscreen for activators of the Aryl Hydrocarbon Receptor (AHR): cell-based high throughput dose response screening assay for activators of the Pregnane X Receptor (PXR) PubChem Bioassay (2010)[AID] 
Target
Name:
Nuclear receptor subfamily 1 group I member 2
Synonyms:
NR1I2 Orphan nuclear receptor PAR1 PXR SXR nuclear receptor subfamily 1 group I member 2 isoform 1
Type:
Nuclear receptor
Mol. Mass.:
49774.77
Organism:
Homo sapiens (Human)
Description:
O75469
Residue:
434
  
Inhibitor
Name:
BDBM38363
Synonyms:
(6Z)-4-ethyl-3-hydroxy-6-[1-(hydroxyamino)-2-(2-quinolinyl)ethylidene]-1-cyclohexa-2,4-dienone (6Z)-4-ethyl-3-hydroxy-6-[1-(hydroxyamino)-2-quinolin-2-ylethylidene]cyclohexa-2,4-dien-1-one MLS000054212 cid_5742518
Type:
Small organic molecule
Emp. Form.:
C19H18N2O3
Mol. Mass.:
322.3578
SMILES:
CCc1cc(C(Cc2ccc3ccccc3n2)N=O)c(O)cc1O
: