Target
Nuclear receptor subfamily 1 group I member 2
Ligand
BDBM75460
Substrate
Meas. Tech.
Luminescence-based counterscreen for activators of the Aryl Hydrocarbon Receptor (AHR): cell-based high throughput dose response screening assay for activators of the Pregnane X Receptor (PXR)
EC50
>116109±n/a nM
Citation
 PubChem, PC Luminescence-based counterscreen for activators of the Aryl Hydrocarbon Receptor (AHR): cell-based high throughput dose response screening assay for activators of the Pregnane X Receptor (PXR) PubChem Bioassay (2010)[AID] 
Target
Name:
Nuclear receptor subfamily 1 group I member 2
Synonyms:
NR1I2 Orphan nuclear receptor PAR1 PXR SXR nuclear receptor subfamily 1 group I member 2 isoform 1
Type:
Nuclear receptor
Mol. Mass.:
49774.77
Organism:
Homo sapiens (Human)
Description:
O75469
Residue:
434
  
Inhibitor
Name:
BDBM75460
Synonyms:
MLS000102809 N-(1,3-benzodioxol-5-yl)-3-(3,4-dimethylphenyl)-2,4-diketo-1H-pyrimidine-5-carboxamide SMR000016950 | cid_5044706
Type:
Small organic molecule
Emp. Form.:
C20H17N3O5
Mol. Mass.:
379.3661
SMILES:
Cc1ccc(cc1C)-n1c(=O)[nH]cc(C(=O)Nc2ccc3OCOc3c2)c1=O
: