Target
Nuclear receptor subfamily 1 group I member 2
Ligand
BDBM75474
Substrate
Meas. Tech.
Luminescence-based counterscreen for activators of the Aryl Hydrocarbon Receptor (AHR): cell-based high throughput dose response screening assay for activators of the Pregnane X Receptor (PXR)
EC50
>116147±n/a nM
Citation
 PubChem, PC Luminescence-based counterscreen for activators of the Aryl Hydrocarbon Receptor (AHR): cell-based high throughput dose response screening assay for activators of the Pregnane X Receptor (PXR) PubChem Bioassay (2010)[AID] 
Target
Name:
Nuclear receptor subfamily 1 group I member 2
Synonyms:
NR1I2 Orphan nuclear receptor PAR1 PXR SXR nuclear receptor subfamily 1 group I member 2 isoform 1
Type:
Nuclear receptor
Mol. Mass.:
49774.77
Organism:
Homo sapiens (Human)
Description:
O75469
Residue:
434
  
Inhibitor
Name:
BDBM75474
Synonyms:
MLS000536798 N'-[(Z)-indol-3-ylidenemethyl]-2,4-dimethyl-1,3-thiazole-5-carbohydrazide SMR000155665 | cid_6508152
Type:
Small organic molecule
Emp. Form.:
C15H14N4OS
Mol. Mass.:
298.363
SMILES:
Cc1nc(C)c(s1)C(=O)NN=Cc1c[nH]c2ccccc12
: