Target
Nuclear receptor subfamily 1 group I member 2
Ligand
BDBM75512
Substrate
Meas. Tech.
Luminescence-based counterscreen for activators of the Aryl Hydrocarbon Receptor (AHR): cell-based high throughput dose response screening assay for activators of the Pregnane X Receptor (PXR)
EC50
>116193±n/a nM
Citation
 PubChem, PC Luminescence-based counterscreen for activators of the Aryl Hydrocarbon Receptor (AHR): cell-based high throughput dose response screening assay for activators of the Pregnane X Receptor (PXR) PubChem Bioassay (2010)[AID] 
Target
Name:
Nuclear receptor subfamily 1 group I member 2
Synonyms:
NR1I2 Orphan nuclear receptor PAR1 PXR SXR nuclear receptor subfamily 1 group I member 2 isoform 1
Type:
Nuclear receptor
Mol. Mass.:
49774.77
Organism:
Homo sapiens (Human)
Description:
O75469
Residue:
434
  
Inhibitor
Name:
BDBM75512
Synonyms:
1-(4-bromophenyl)-2-(2,3-dimethyl-1-pyridin-1-iumyl)ethanone;bromide 1-[2-(4-bromophenyl)-2-oxoethyl]-2,3-dimethylpyridinium bromide SMR000496151 | cid_2841483
Type:
Small organic molecule
Emp. Form.:
C15H15BrNO
Mol. Mass.:
305.189
SMILES:
Cc1ccc[n+](CC(=O)c2ccc(Br)cc2)c1C
: