Target
Nuclear receptor subfamily 1 group I member 2
Ligand
BDBM75521
Substrate
Meas. Tech.
Luminescence-based counterscreen for activators of the Aryl Hydrocarbon Receptor (AHR): cell-based high throughput dose response screening assay for activators of the Pregnane X Receptor (PXR)
EC50
>116134±n/a nM
Citation
 PubChem, PC Luminescence-based counterscreen for activators of the Aryl Hydrocarbon Receptor (AHR): cell-based high throughput dose response screening assay for activators of the Pregnane X Receptor (PXR) PubChem Bioassay (2010)[AID] 
Target
Name:
Nuclear receptor subfamily 1 group I member 2
Synonyms:
NR1I2 Orphan nuclear receptor PAR1 PXR SXR nuclear receptor subfamily 1 group I member 2 isoform 1
Type:
Nuclear receptor
Mol. Mass.:
49774.77
Organism:
Homo sapiens (Human)
Description:
O75469
Residue:
434
  
Inhibitor
Name:
BDBM75521
Synonyms:
(5-Chloro-pyridin-2-yl)-(3,5-dinitro-pyridin-2-yl)-amine MLS001202736 N-(5-chloro-2-pyridinyl)-3,5-dinitro-2-pyridinamine SMR000513318 | cid_3097917
Type:
Small organic molecule
Emp. Form.:
C10H6ClN5O4
Mol. Mass.:
295.639
SMILES:
[O-][N+](=O)c1cnc(Nc2ccc(Cl)cn2)c(c1)[N+]([O-])=O
: