Target
Nuclear receptor subfamily 1 group I member 2
Ligand
BDBM75534
Substrate
Meas. Tech.
Luminescence-based counterscreen for activators of the Aryl Hydrocarbon Receptor (AHR): cell-based high throughput dose response screening assay for activators of the Pregnane X Receptor (PXR)
EC50
60376±n/a nM
Citation
 PubChem, PC Luminescence-based counterscreen for activators of the Aryl Hydrocarbon Receptor (AHR): cell-based high throughput dose response screening assay for activators of the Pregnane X Receptor (PXR) PubChem Bioassay (2010)[AID] 
Target
Name:
Nuclear receptor subfamily 1 group I member 2
Synonyms:
NR1I2 Orphan nuclear receptor PAR1 PXR SXR nuclear receptor subfamily 1 group I member 2 isoform 1
Type:
Nuclear receptor
Mol. Mass.:
49774.77
Organism:
Homo sapiens (Human)
Description:
O75469
Residue:
434
  
Inhibitor
Name:
BDBM75534
Synonyms:
MLS001060579 N-[(3-chloro-4-fluoro-phenyl)thiocarbamoyl]cyclopropanecarboxamide N-[(3-chloro-4-fluorophenyl)carbamothioyl]cyclopropanecarboxamide cid_1257250
Type:
Small organic molecule
Emp. Form.:
C11H10ClFN2OS
Mol. Mass.:
272.726
SMILES:
Fc1ccc(NC(=S)NC(=O)C2CC2)cc1Cl
: