Target
Aryl hydrocarbon receptor
Ligand
BDBM43585
Substrate
Meas. Tech.
Luminescence-based cell-based high throughput dose response assay for activators of the Aryl Hydrocarbon Receptor (AHR)
EC50
482.93±n/a nM
Citation
 PubChem, PC Luminescence-based cell-based high throughput dose response assay for activators of the Aryl Hydrocarbon Receptor (AHR) PubChem Bioassay (2010)[AID] 
Target
Name:
Aryl hydrocarbon receptor
Synonyms:
AHR BHLHE76 aryl hydrocarbon receptor precursor
Type:
PROTEIN
Mol. Mass.:
96143.77
Organism:
Homo sapiens (Human)
Description:
ChEMBL_1503828
Residue:
848
  
Inhibitor
Name:
BDBM43585
Synonyms:
3-(4-chlorophenyl)-1-methyl-N-[3-(4-methyl-1-piperazinyl)propyl]-5-thieno[2,3-c]pyrazolecarboxamide 3-(4-chlorophenyl)-1-methyl-N-[3-(4-methylpiperazino)propyl]thieno[2,3-c]pyrazole-5-carboxamide SMR000094249 | cid_5308230
Type:
Small organic molecule
Emp. Form.:
C21H26ClN5OS
Mol. Mass.:
431.982
SMILES:
CN1CCN(CCCNC(=O)c2cc3c(nn(C)c3s2)-c2ccc(Cl)cc2)CC1
: