Target
Aryl hydrocarbon receptor
Ligand
BDBM75492
Substrate
Meas. Tech.
Luminescence-based cell-based high throughput dose response assay for activators of the Aryl Hydrocarbon Receptor (AHR)
EC50
3408±n/a nM
Citation
 PubChem, PC Luminescence-based cell-based high throughput dose response assay for activators of the Aryl Hydrocarbon Receptor (AHR) PubChem Bioassay (2010)[AID] 
Target
Name:
Aryl hydrocarbon receptor
Synonyms:
AHR BHLHE76 aryl hydrocarbon receptor precursor
Type:
PROTEIN
Mol. Mass.:
96143.77
Organism:
Homo sapiens (Human)
Description:
ChEMBL_1503828
Residue:
848
  
Inhibitor
Name:
BDBM75492
Synonyms:
7-hydroxy-8-[(Z)-1-oxo-3-thiophen-2-ylprop-2-enyl]-1-benzopyran-2-one 7-hydroxy-8-[(Z)-3-thiophen-2-ylprop-2-enoyl]chromen-2-one 7-oxidanyl-8-[(Z)-3-thiophen-2-ylprop-2-enoyl]chromen-2-one SMR000231661 | cid_11840027
Type:
Small organic molecule
Emp. Form.:
C16H10O4S
Mol. Mass.:
298.313
SMILES:
Oc1ccc2ccc(=O)oc2c1C(=O)\C=C/c1cccs1
: