Target
Aryl hydrocarbon receptor
Ligand
BDBM75495
Substrate
Meas. Tech.
Luminescence-based cell-based high throughput dose response assay for activators of the Aryl Hydrocarbon Receptor (AHR)
EC50
1364±n/a nM
Citation
 PubChem, PC Luminescence-based cell-based high throughput dose response assay for activators of the Aryl Hydrocarbon Receptor (AHR) PubChem Bioassay (2010)[AID] 
Target
Name:
Aryl hydrocarbon receptor
Synonyms:
AHR BHLHE76 aryl hydrocarbon receptor precursor
Type:
PROTEIN
Mol. Mass.:
96143.77
Organism:
Homo sapiens (Human)
Description:
ChEMBL_1503828
Residue:
848
  
Inhibitor
Name:
BDBM75495
Synonyms:
2-(4-methylanilino)-3-pyridinecarboxamide 2-(4-toluidino)nicotinamide 2-[(4-methylphenyl)amino]pyridine-3-carboxamide SMR000226873 | cid_901941
Type:
Small organic molecule
Emp. Form.:
C13H13N3O
Mol. Mass.:
227.2618
SMILES:
Cc1ccc(Nc2ncccc2C(N)=O)cc1
: