Target
Aryl hydrocarbon receptor
Ligand
BDBM75496
Substrate
Meas. Tech.
Luminescence-based cell-based high throughput dose response assay for activators of the Aryl Hydrocarbon Receptor (AHR)
EC50
2615±n/a nM
Citation
 PubChem, PC Luminescence-based cell-based high throughput dose response assay for activators of the Aryl Hydrocarbon Receptor (AHR) PubChem Bioassay (2010)[AID] 
Target
Name:
Aryl hydrocarbon receptor
Synonyms:
AHR BHLHE76 aryl hydrocarbon receptor precursor
Type:
PROTEIN
Mol. Mass.:
96143.77
Organism:
Homo sapiens (Human)
Description:
ChEMBL_1503828
Residue:
848
  
Inhibitor
Name:
BDBM75496
Synonyms:
2-(4-morpholinyl)-N-(6-nitro-1,3-benzothiazol-2-yl)acetamide 2-morpholin-4-yl-N-(6-nitro-1,3-benzothiazol-2-yl)ethanamide MLS000708990 cid_883409
Type:
Small organic molecule
Emp. Form.:
C13H14N4O4S
Mol. Mass.:
322.34
SMILES:
[O-][N+](=O)c1ccc2nc(NC(=O)CN3CCOCC3)sc2c1
: