Target
Sphingosine 1-phosphate receptor 4
Ligand
BDBM75605
Substrate
Meas. Tech.
Late-stage fluorescence dose-response cell-based assay to identify agonists of the Sphingosine 1-Phosphate Receptor 4 (S1P4): Synthesized compounds
EC50
12000±n/a nM
Citation
 PubChem, PC Late-stage fluorescence dose-response cell-based assay to identify agonists of the Sphingosine 1-Phosphate Receptor 4 (S1P4): Synthesized compounds PubChem Bioassay (2010)[AID] 
Target
Name:
Sphingosine 1-phosphate receptor 4
Synonyms:
EDG6 S1P receptor 4 S1P4 S1PR4_HUMAN Sphingosine 1-phosphate receptor Edg-6 sphingosine-1-phosphate 4 S1P4
Type:
G Protein-Coupled Receptor (GPCR)
Mol. Mass.:
41647.39
Organism:
Homo sapiens (Human)
Description:
Residue:
384
  
Inhibitor
Name:
BDBM75605
Synonyms:
2-chloro-3-[2-(2,4-dichlorophenoxy)ethoxy]-6-(methoxymethyl)pyridine CYM50257 SR-02000000307-1 | cid_44620893
Type:
Small organic molecule
Emp. Form.:
C15H14Cl3NO3
Mol. Mass.:
362.636
SMILES:
COCc1ccc(OCCOc2ccc(Cl)cc2Cl)c(Cl)n1
: