Target
Vasopressin V1a receptor
Ligand
BDBM47719
Substrate
Meas. Tech.
Counterscreen for Oxytocin Receptor (OXTR) agonists: Fluorescence-based cell-based high throughput dose response assay to identify agonists of the vasopressin 1 receptor (V1R)
EC50
>29913±n/a nM
Citation
 PubChem, PC Counterscreen for Oxytocin Receptor (OXTR) agonists: Fluorescence-based cell-based high throughput dose response assay to identify agonists of the vasopressin 1 receptor (V1R) PubChem Bioassay (2010)[AID] 
Target
Name:
Vasopressin V1a receptor
Synonyms:
AVPR V1a AVPR1A V1AR_HUMAN VASOPRESSIN V1A Vasopressin V1 receptor Vasopressin receptor
Type:
Receptor
Mol. Mass.:
46820.18
Organism:
Homo sapiens (Human)
Description:
P37288
Residue:
418
  
Inhibitor
Name:
BDBM47719
Synonyms:
(4-chlorodithiazol-5-ylidene)-(4-chloro-2-methyl-phenyl)amine 4-chloro-N-(4-chloro-2-methylphenyl)-5-dithiazolimine 4-chloro-N-(4-chloro-5H-1,2,3-dithiazol-5-yliden)-2-methylaniline SMR000125448 | cid_1471255
Type:
Small organic molecule
Emp. Form.:
C9H6Cl2N2S2
Mol. Mass.:
277.193
SMILES:
Cc1cc(Cl)ccc1\N=c1\ssnc1Cl
: