Target
Intestinal-type alkaline phosphatase
Ligand
BDBM75617
Substrate
Meas. Tech.
Dose Response concentration confirmation of uHTS hits from a small molecule activators of human intestinal alkaline phosphatase via a luminescent assay
EC50
13000±n/a nM
Citation
 PubChem, PC Dose Response concentration confirmation of uHTS hits from a small molecule activators of human intestinal alkaline phosphatase via a luminescent assay PubChem Bioassay (2010)[AID] 
Target
Name:
Intestinal-type alkaline phosphatase
Synonyms:
ALPI Intestinal alkaline phosphatase | PPBI_HUMAN
Type:
PROTEIN
Mol. Mass.:
56804.94
Organism:
Homo sapiens (Human)
Description:
ChEMBL_1278525
Residue:
528
  
Inhibitor
Name:
BDBM75617
Synonyms:
(5E)-5-(6-keto-3-methyl-cyclohexa-2,4-dien-1-ylidene)-N-piperonyl-3-pyrazoline-3-carboxamide (5E)-N-(1,3-benzodioxol-5-ylmethyl)-5-(3-methyl-6-oxo-1-cyclohexa-2,4-dienylidene)-1,2-dihydropyrazole-3-carboxamide 5-(2-Hydroxy-5-methyl-phenyl)-2H-pyrazole-3-carboxylic acid (benzo[1,3]dioxol-5-ylmethyl)-amide SMR000145754 | cid_6100293
Type:
Small organic molecule
Emp. Form.:
C19H17N3O4
Mol. Mass.:
351.356
SMILES:
Cc1ccc(O)c(c1)-c1cc([nH]n1)C(=O)NCc1ccc2OCOc2c1
: