Target
Intestinal-type alkaline phosphatase
Ligand
BDBM75699
Substrate
Meas. Tech.
Dose Response concentration confirmation of uHTS hits from a small molecule activators of human intestinal alkaline phosphatase via a luminescent assay
EC50
40700±n/a nM
Citation
 PubChem, PC Dose Response concentration confirmation of uHTS hits from a small molecule activators of human intestinal alkaline phosphatase via a luminescent assay PubChem Bioassay (2010)[AID] 
Target
Name:
Intestinal-type alkaline phosphatase
Synonyms:
ALPI Intestinal alkaline phosphatase | PPBI_HUMAN
Type:
PROTEIN
Mol. Mass.:
56804.94
Organism:
Homo sapiens (Human)
Description:
ChEMBL_1278525
Residue:
528
  
Inhibitor
Name:
BDBM75699
Synonyms:
MLS002153695 SMR001231073 | cid_25163023
Type:
Small organic molecule
Emp. Form.:
C64H111N19O8S
Mol. Mass.:
1306.754
SMILES:
[#6]-[#6]-[#6@H](-[#6])-[#6@@H](-[#6](=O)-[#7]-[#6]-[#6]-[#6]-[#6]-[#6]-[#6]-[#6]-[#6]-[#6]-[#6]-[#6](=O)-[#7]-1-[#6]-[#6]-[#7](-[#6]-[#6]-1)-c1nc(-[#7]-[#6]-[#6]-[#8]-[#6]-[#6]-[#8]-[#6]-[#6]-[#8]-[#6]C#C)nc(n1)-[#7]-1-[#6]-[#6]-[#7](-[#6]-[#6]-1)-[#6](=O)-[#6]-[#6]-[#6]-[#6]-[#6]-[#6]-[#6]-[#6]-[#6]-[#6]-[#7]-[#6](=O)-[#6@H](-[#6]-[#8])-n1cc(-[#6]-[#6]-[#6]-[#16]-[#6])nn1)-n1cc(-[#6]-[#6]-[#6]-[#6]\[#7]=[#6](\[#7])-[#7])nn1
: