Target
Vasopressin V1a receptor
Ligand
BDBM66022
Substrate
Meas. Tech.
Fluorescence-based cell-based high throughput dose response screening assay for agonists of the vasopressin 1 receptor (V1R)
EC50
8366±n/a nM
Citation
 PubChem, PC Fluorescence-based cell-based high throughput dose response screening assay for agonists of the vasopressin 1 receptor (V1R) PubChem Bioassay (2010)[AID] 
Target
Name:
Vasopressin V1a receptor
Synonyms:
AVPR V1a AVPR1A V1AR_HUMAN VASOPRESSIN V1A Vasopressin V1 receptor Vasopressin receptor
Type:
Receptor
Mol. Mass.:
46820.18
Organism:
Homo sapiens (Human)
Description:
P37288
Residue:
418
  
Inhibitor
Name:
BDBM66022
Synonyms:
KE-IK SMR001231046 | cid_25163004
Type:
Small organic molecule
Emp. Form.:
C67H116N18O9
Mol. Mass.:
1317.7531
SMILES:
CC[C@H](C)Cc1cn(nn1)[C@@H](CCCCN)C(=O)NCCCCCCCCCCC(=O)N1CCN(CC1)c1nc(NCCOCCOCCOCC#C)nc(n1)N1CCN(CC1)C(=O)CCCCCCCCCCNC(=O)[C@@H](CCC(O)=O)n1cc(CCCCCN)nn1
: