Target
Intestinal-type alkaline phosphatase
Ligand
BDBM39584
Substrate
Meas. Tech.
Dose Response confirmation of uHTS hits from a small molecule inhibitors of human intestinal alkaline phosphatase via a luminescent assay
IC50
>100000±n/a nM
Citation
 PubChem, PC Dose Response confirmation of uHTS hits from a small molecule inhibitors of human intestinal alkaline phosphatase via a luminescent assay PubChem Bioassay (2010)[AID] 
Target
Name:
Intestinal-type alkaline phosphatase
Synonyms:
ALPI Intestinal alkaline phosphatase | PPBI_HUMAN
Type:
PROTEIN
Mol. Mass.:
56804.94
Organism:
Homo sapiens (Human)
Description:
ChEMBL_1278525
Residue:
528
  
Inhibitor
Name:
BDBM39584
Synonyms:
5,6-Dimethyl-2-[1-(1-thiophen-2-ylmethyl-1H-tetrazol-5-ylmethyl)-piperidin-4-yl]-1H-benzoimidazole 5,6-dimethyl-2-[1-[[1-(thiophen-2-ylmethyl)-1,2,3,4-tetrazol-5-yl]methyl]piperidin-4-yl]-1H-benzimidazole 5,6-dimethyl-2-[1-[[1-(thiophen-2-ylmethyl)tetrazol-5-yl]methyl]piperidin-4-yl]-1H-benzimidazole SMR000007065 | cid_655425
Type:
Small organic molecule
Emp. Form.:
C21H25N7S
Mol. Mass.:
407.535
SMILES:
Cc1cc2nc([nH]c2cc1C)C1CCN(Cc2nnnn2Cc2cccs2)CC1
: