Target
Intestinal-type alkaline phosphatase
Ligand
BDBM41873
Substrate
Meas. Tech.
Dose Response confirmation of uHTS hits from a small molecule inhibitors of human intestinal alkaline phosphatase via a luminescent assay
IC50
1230±n/a nM
Citation
 PubChem, PC Dose Response confirmation of uHTS hits from a small molecule inhibitors of human intestinal alkaline phosphatase via a luminescent assay PubChem Bioassay (2010)[AID] 
Target
Name:
Intestinal-type alkaline phosphatase
Synonyms:
ALPI Intestinal alkaline phosphatase | PPBI_HUMAN
Type:
PROTEIN
Mol. Mass.:
56804.94
Organism:
Homo sapiens (Human)
Description:
ChEMBL_1278525
Residue:
528
  
Inhibitor
Name:
BDBM41873
Synonyms:
2-[5-(2-furanyl)-1H-1,2,4-triazol-3-yl]-1,3-dioxo-5-isoindolecarboxylic acid 2-[5-(furan-2-yl)-1H-1,2,4-triazol-3-yl]-1,3-bis(oxidanylidene)isoindole-5-carboxylic acid MLS-0146260.0001 | cid_2971779
Type:
Small organic molecule
Emp. Form.:
C15H8N4O5
Mol. Mass.:
324.2478
SMILES:
OC(=O)c1ccc2C(=O)N(C(=O)c2c1)c1nnc([nH]1)-c1ccco1
: