Target
Intestinal-type alkaline phosphatase
Ligand
BDBM75770
Substrate
Meas. Tech.
Dose Response confirmation of uHTS hits from a small molecule inhibitors of human intestinal alkaline phosphatase via a luminescent assay
IC50
>100000±n/a nM
Citation
 PubChem, PC Dose Response confirmation of uHTS hits from a small molecule inhibitors of human intestinal alkaline phosphatase via a luminescent assay PubChem Bioassay (2010)[AID] 
Target
Name:
Intestinal-type alkaline phosphatase
Synonyms:
ALPI Intestinal alkaline phosphatase | PPBI_HUMAN
Type:
PROTEIN
Mol. Mass.:
56804.94
Organism:
Homo sapiens (Human)
Description:
ChEMBL_1278525
Residue:
528
  
Inhibitor
Name:
BDBM75770
Synonyms:
MLS001162029 SMR000670690 | cid_6460430
Type:
Small organic molecule
Emp. Form.:
C16H20N4O
Mol. Mass.:
284.3562
SMILES:
O=C(NC1CCCCCC1)c1ccc(cc1)-n1cnnc1
: