Target
Type-1 angiotensin II receptor
Ligand
BDBM41591
Substrate
Meas. Tech.
Dose Response screen for antagonists of Angiotensin II Receptor Type 1 to assess selectivity of uHTS small molecule antagonists hits of the APJ receptor
IC50
2255±145 nM
Citation
 PubChem, PC Dose Response screen for antagonists of Angiotensin II Receptor Type 1 to assess selectivity of uHTS small molecule antagonists hits of the APJ receptor PubChem Bioassay (2010)[AID] 
Target
Name:
Type-1 angiotensin II receptor
Synonyms:
AGTR1 AGTR1B AT1 AT1BR AT2R1B Angiotensin II receptor Type-1 angiotensin II receptor (AT1)
Type:
Protein
Mol. Mass.:
41080.75
Organism:
Homo sapiens (Human)
Description:
P30556
Residue:
359
  
Inhibitor
Name:
BDBM41591
Synonyms:
(Z)-2,3-bis(chloranyl)-N-(6-methoxypyridin-3-yl)-3-[(4-methylphenyl)methylsulfinyl]prop-2-enamide (Z)-2,3-dichloro-N-(6-methoxy-3-pyridyl)-3-(4-methylbenzyl)sulfinyl-acrylamide 2,3-dichloro-N-(6-methoxy-3-pyridinyl)-3-[(4-methylbenzyl)sulfinyl]acrylamide SMR000125562 | cid_1472225
Type:
Small organic molecule
Emp. Form.:
C17H16Cl2N2O3S
Mol. Mass.:
399.292
SMILES:
COc1ccc(NC(=O)C(Cl)=C(Cl)S(=O)Cc2ccc(C)cc2)cn1
: