Target
Type-1 angiotensin II receptor
Ligand
BDBM60264
Substrate
Meas. Tech.
Dose Response screen for antagonists of Angiotensin II Receptor Type 1 to assess selectivity of uHTS small molecule antagonists hits of the APJ receptor
IC50
2581±222 nM
Citation
 PubChem, PC Dose Response screen for antagonists of Angiotensin II Receptor Type 1 to assess selectivity of uHTS small molecule antagonists hits of the APJ receptor PubChem Bioassay (2010)[AID] 
Target
Name:
Type-1 angiotensin II receptor
Synonyms:
AGTR1 AGTR1B AT1 AT1BR AT2R1B Angiotensin II receptor Type-1 angiotensin II receptor (AT1)
Type:
Protein
Mol. Mass.:
41080.75
Organism:
Homo sapiens (Human)
Description:
P30556
Residue:
359
  
Inhibitor
Name:
BDBM60264
Synonyms:
2-(4-Bromo-phenyl)-quinoline-4-carboxylic acid [1-pyridin-2-yl-meth-(E)-ylidene]-hydrazide 2-(4-bromophenyl)-N-(2-pyridylmethyleneamino)cinchoninamide MLS000767800 cid_1970900
Type:
Small organic molecule
Emp. Form.:
C22H15BrN4O
Mol. Mass.:
431.285
SMILES:
Brc1ccc(cc1)-c1cc(C(=O)NN=Cc2ccccn2)c2ccccc2n1
: