Target
G-protein coupled receptor 35
Ligand
BDBM61653
Substrate
Meas. Tech.
SAR Analysis for the identification of Selective Antagonists of ERK1/2 Activity in GPR35-Overexpressing U2OS Cells
IC50
1888±222 nM
Citation
 PubChem, PC SAR Analysis for the identification of Selective Antagonists of ERK1/2 Activity in GPR35-Overexpressing U2OS Cells PubChem Bioassay (2010)[AID] 
Target
Name:
G-protein coupled receptor 35
Synonyms:
G protein-coupled receptor 35 GPR35_HUMAN
Type:
Enzyme Catalytic Domain
Mol. Mass.:
34085.57
Organism:
Homo sapiens (Human)
Description:
gi_33695097
Residue:
309
  
Inhibitor
Name:
BDBM61653
Synonyms:
3-[4-[(5Z)-4-keto-5-piperonylidene-2-thioxo-thiazolidin-3-yl]butanoylamino]benzoic acid 3-[4-[(5Z)-5-(1,3-benzodioxol-5-ylmethylidene)-4-oxo-2-sulfanylidene-1,3-thiazolidin-3-yl]butanoylamino]benzoic acid MLS001083057 cid_2277094
Type:
Small organic molecule
Emp. Form.:
C22H18N2O6S2
Mol. Mass.:
470.518
SMILES:
OC(=O)c1cccc(NC(=O)CCCN2C(=S)S\C(=C/c3ccc4OCOc4c3)C2=O)c1
: