Target
Insulin-degrading enzyme
Ligand
BDBM75807
Substrate
Meas. Tech.
Dose Response: Fluorescence polarization-based cell-based high throughput dose response assay for inhibitors of insulin-degrading enzyme (IDE)
IC50
13861±n/a nM
Citation
 PubChem, PC Dose Response: Fluorescence polarization-based cell-based high throughput dose response assay for inhibitors of insulin-degrading enzyme (IDE) PubChem Bioassay (2010)[AID] 
Target
Name:
Insulin-degrading enzyme
Synonyms:
Abeta-degrading protease IDE Insulin degrading enzyme (hIDE) Insulin-degrading enzyme Insulysin | insulin-degrading enzyme isoform 1 precursor
Type:
Enzyme Catalytic Domain
Mol. Mass.:
117968.59
Organism:
Homo sapiens (Human)
Description:
P14735
Residue:
1019
  
Inhibitor
Name:
BDBM75807
Synonyms:
4-[(4E)-4-[4-(dimethylamino)benzylidene]-5-keto-3-methyl-2-thioxo-imidazolidin-1-yl]-1,5-dimethyl-2-phenyl-3-pyrazolin-3-one 4-[(4E)-4-[[4-(dimethylamino)phenyl]methylidene]-3-methyl-5-oxo-2-sulfanylidene-1-imidazolidinyl]-1,5-dimethyl-2-phenyl-3-pyrazolone MLS000417557 cid_2538305
Type:
Small organic molecule
Emp. Form.:
C24H25N5O2S
Mol. Mass.:
447.553
SMILES:
CN(C)c1ccc(\C=C2\N(C)C(=S)N(C2=O)c2c(C)n(C)n(-c3ccccc3)c2=O)cc1
: