Target
Insulin-degrading enzyme
Ligand
BDBM75819
Substrate
Meas. Tech.
Dose Response: Fluorescence polarization-based cell-based high throughput dose response assay for inhibitors of insulin-degrading enzyme (IDE)
IC50
30674±n/a nM
Citation
 PubChem, PC Dose Response: Fluorescence polarization-based cell-based high throughput dose response assay for inhibitors of insulin-degrading enzyme (IDE) PubChem Bioassay (2010)[AID] 
Target
Name:
Insulin-degrading enzyme
Synonyms:
Abeta-degrading protease IDE Insulin degrading enzyme (hIDE) Insulin-degrading enzyme Insulysin | insulin-degrading enzyme isoform 1 precursor
Type:
Enzyme Catalytic Domain
Mol. Mass.:
117968.59
Organism:
Homo sapiens (Human)
Description:
P14735
Residue:
1019
  
Inhibitor
Name:
BDBM75819
Synonyms:
(5Z)-3-ethyl-5-[(2Z)-2-(1-methyl-2-pyrrolidinylidene)ethylidene]-2-sulfanylidene-4-oxazolidinone (5Z)-3-ethyl-5-[(2Z)-2-(1-methylpyrrolidin-2-ylidene)ethylidene]-2-thioxo-oxazolidin-4-one SMR000284771 | cid_5749163
Type:
Small organic molecule
Emp. Form.:
C12H16N2O2S
Mol. Mass.:
252.333
SMILES:
CCN1C(=S)O\C(=C/C=C2/CCCN2C)C1=O
: