Target
Insulin-degrading enzyme
Ligand
BDBM75832
Substrate
Meas. Tech.
Dose Response: Fluorescence polarization-based cell-based high throughput dose response assay for inhibitors of insulin-degrading enzyme (IDE)
IC50
42485±n/a nM
Citation
 PubChem, PC Dose Response: Fluorescence polarization-based cell-based high throughput dose response assay for inhibitors of insulin-degrading enzyme (IDE) PubChem Bioassay (2010)[AID] 
Target
Name:
Insulin-degrading enzyme
Synonyms:
Abeta-degrading protease IDE Insulin degrading enzyme (hIDE) Insulin-degrading enzyme Insulysin | insulin-degrading enzyme isoform 1 precursor
Type:
Enzyme Catalytic Domain
Mol. Mass.:
117968.59
Organism:
Homo sapiens (Human)
Description:
P14735
Residue:
1019
  
Inhibitor
Name:
BDBM75832
Synonyms:
2-[[(Z)-2-benzamido-3-(9-methyl-3-carbazolyl)-1-oxoprop-2-enyl]amino]acetic acid 2-[[(Z)-2-benzamido-3-(9-methylcarbazol-3-yl)prop-2-enoyl]amino]acetic acid MLS000777760 [(Z)-2-Benzoylamino-3-(9-methyl-9H-carbazol-3-yl)-acryloylamino]-acetic acid | cid_1916821
Type:
Small organic molecule
Emp. Form.:
C25H21N3O4
Mol. Mass.:
427.4519
SMILES:
Cn1c2ccccc2c2cc(\C=C(/NC(=O)c3ccccc3)C(=O)NCC(O)=O)ccc12
: