Target
Insulin-degrading enzyme
Ligand
BDBM51304
Substrate
Meas. Tech.
Dose Response: Fluorescence polarization-based cell-based high throughput dose response assay for inhibitors of insulin-degrading enzyme (IDE)
IC50
>55905±n/a nM
Citation
 PubChem, PC Dose Response: Fluorescence polarization-based cell-based high throughput dose response assay for inhibitors of insulin-degrading enzyme (IDE) PubChem Bioassay (2010)[AID] 
Target
Name:
Insulin-degrading enzyme
Synonyms:
Abeta-degrading protease IDE Insulin degrading enzyme (hIDE) Insulin-degrading enzyme Insulysin | insulin-degrading enzyme isoform 1 precursor
Type:
Enzyme Catalytic Domain
Mol. Mass.:
117968.59
Organism:
Homo sapiens (Human)
Description:
P14735
Residue:
1019
  
Inhibitor
Name:
BDBM51304
Synonyms:
(3Z)-3-[(2-phenyl-1H-imidazol-5-yl)methylene]oxindole 3-[(2-phenyl-1H-imidazol-4-yl)methylene]-1,3-dihydro-2H-indol-2-one SMR000458374 | cid_5714571
Type:
Small organic molecule
Emp. Form.:
C18H13N3O
Mol. Mass.:
287.3153
SMILES:
O=C1Nc2ccccc2C1=Cc1cnc([nH]1)-c1ccccc1
: