Target
G-protein coupled receptor 55
Ligand
BDBM75859
Substrate
Meas. Tech.
SAR Analysis of Selective Antagonists of GPR55 using an Image-Based Assay - Set 3
IC50
6580±n/a nM
Citation
 PubChem, PC SAR Analysis of Selective Antagonists of GPR55 using an Image-Based Assay - Set 3 PubChem Bioassay (2010)[AID] 
Target
Name:
G-protein coupled receptor 55
Synonyms:
G protein-coupled receptor 55 GPR55_HUMAN
Type:
PROTEIN
Mol. Mass.:
36649.72
Organism:
Homo sapiens (Human)
Description:
ChEMBL_1292265
Residue:
319
  
Inhibitor
Name:
BDBM75859
Synonyms:
5-[(E)-(tert-butylthiocarbamoylhydrazono)methyl]-1-phenyl-pyrazole-4-carboxylic acid methyl ester MLS-0437442.0001 methyl 5-[(E)-(tert-butylcarbamothioylhydrazinylidene)methyl]-1-phenyl-pyrazole-4-carboxylate | methyl 5-[(E)-(tert-butylcarbamothioylhydrazinylidene)methyl]-1-phenylpyrazole-4-carboxylate
Type:
Small organic molecule
Emp. Form.:
C17H21N5O2S
Mol. Mass.:
359.446
SMILES:
COC(=O)c1cnn(c1C=NNC(=S)NC(C)(C)C)-c1ccccc1
: