Target
G-protein coupled receptor 55
Ligand
BDBM75864
Substrate
Meas. Tech.
SAR Analysis of Selective Antagonists of GPR55 using an Image-Based Assay - Set 3
IC50
>32000±n/a nM
Citation
 PubChem, PC SAR Analysis of Selective Antagonists of GPR55 using an Image-Based Assay - Set 3 PubChem Bioassay (2010)[AID] 
Target
Name:
G-protein coupled receptor 55
Synonyms:
G protein-coupled receptor 55 GPR55_HUMAN
Type:
PROTEIN
Mol. Mass.:
36649.72
Organism:
Homo sapiens (Human)
Description:
ChEMBL_1292265
Residue:
319
  
Inhibitor
Name:
BDBM75864
Synonyms:
5-[(E)-[(4-chlorophenyl)thiocarbamoylhydrazono]methyl]-1-(2,4-difluorophenyl)pyrazole-4-carboxylic acid methyl ester MLS-0437443.0001 methyl 1-[2,4-bis(fluoranyl)phenyl]-5-[(E)-[(4-chlorophenyl)carbamothioylhydrazinylidene]methyl]pyrazole-4-carboxylate | methyl 5-[(E)-[(4-chlorophenyl)carbamothioylhydrazinylidene]methyl]-1-(2,4-difluorophenyl)pyrazole-4-carboxylate
Type:
Small organic molecule
Emp. Form.:
C19H14ClF2N5O2S
Mol. Mass.:
449.862
SMILES:
COC(=O)c1cnn(c1C=NNC(=S)Nc1ccc(Cl)cc1)-c1ccc(F)cc1F
: