Target
G-protein coupled receptor 55
Ligand
BDBM75870
Substrate
Meas. Tech.
SAR Analysis of Selective Antagonists of GPR55 using an Image-Based Assay - Set 3
IC50
>32000±n/a nM
Citation
 PubChem, PC SAR Analysis of Selective Antagonists of GPR55 using an Image-Based Assay - Set 3 PubChem Bioassay (2010)[AID] 
Target
Name:
G-protein coupled receptor 55
Synonyms:
G protein-coupled receptor 55 GPR55_HUMAN
Type:
PROTEIN
Mol. Mass.:
36649.72
Organism:
Homo sapiens (Human)
Description:
ChEMBL_1292265
Residue:
319
  
Inhibitor
Name:
BDBM75870
Synonyms:
1-phenyl-5-[(E)-(thiocarbamoylhydrazono)methyl]pyrazole-4-carboxylic acid methyl ester MLS-0437447.0001 methyl 5-[(E)-(carbamothioylhydrazinylidene)methyl]-1-phenyl-pyrazole-4-carboxylate | methyl 5-[(E)-(carbamothioylhydrazinylidene)methyl]-1-phenylpyrazole-4-carboxylate
Type:
Small organic molecule
Emp. Form.:
C13H13N5O2S
Mol. Mass.:
303.34
SMILES:
COC(=O)c1cnn(c1C=NNC(N)=S)-c1ccccc1
: