Target
Melanin-concentrating hormone receptor 1
Ligand
BDBM75881
Substrate
Meas. Tech.
Late-stage fluorescence-based counterscreen for antagonists of the G-protein coupled receptor 7 (GPR7)
IC50
17400±n/a nM
Citation
 PubChem, PC Late-stage fluorescence-based counterscreen for antagonists of the G-protein coupled receptor 7 (GPR7): cell-based dose response assay to identify antagonists of the melanin-concentrating hormone receptor 1 (MCHR1) PubChem Bioassay (2010)[AID] 
Target
Name:
Melanin-concentrating hormone receptor 1
Synonyms:
G-protein coupled receptor 24 MCH receptor 1 MCH-R1 MCHR-1 MCHR1_HUMAN Melanin-Concentrating Hormone Receptor 1 (MCH1R) Melanin-concentrating hormone receptor 1 (MCH-1) Melanin-concentrating hormone receptor 1 (MCHR-1) SLC-1 Somatostatin receptor-like protein
Type:
G Protein-Coupled Receptor (GPCR)
Mol. Mass.:
45976.27
Organism:
Homo sapiens (Human)
Description:
Membranes from CHO-K1 cells stably expressing human MCH1R were used in assays.
Residue:
422
  
Inhibitor
Name:
BDBM75881
Synonyms:
4-[2,4-bis(fluoranyl)phenoxy]-5-chloranyl-2-(4-methylphenyl)pyridazin-3-one 5-chloro-4-(2,4-difluorophenoxy)-2-(4-methylphenyl)pyridazin-3-one SR-02000000349 cid_46172927
Type:
Small organic molecule
Emp. Form.:
C17H11ClF2N2O2
Mol. Mass.:
348.731
SMILES:
Cc1ccc(cc1)-n1ncc(Cl)c(Oc2ccc(F)cc2F)c1=O
: