Target
Melanin-concentrating hormone receptor 1
Ligand
BDBM75921
Substrate
Meas. Tech.
Late-stage fluorescence-based counterscreen for antagonists of the G-protein coupled receptor 7 (GPR7)
IC50
4000±n/a nM
Citation
 PubChem, PC Late-stage fluorescence-based counterscreen for antagonists of the G-protein coupled receptor 7 (GPR7): cell-based dose response assay to identify antagonists of the melanin-concentrating hormone receptor 1 (MCHR1) PubChem Bioassay (2010)[AID] 
Target
Name:
Melanin-concentrating hormone receptor 1
Synonyms:
G-protein coupled receptor 24 MCH receptor 1 MCH-R1 MCHR-1 MCHR1_HUMAN Melanin-Concentrating Hormone Receptor 1 (MCH1R) Melanin-concentrating hormone receptor 1 (MCH-1) Melanin-concentrating hormone receptor 1 (MCHR-1) SLC-1 Somatostatin receptor-like protein
Type:
G Protein-Coupled Receptor (GPCR)
Mol. Mass.:
45976.27
Organism:
Homo sapiens (Human)
Description:
Membranes from CHO-K1 cells stably expressing human MCH1R were used in assays.
Residue:
422
  
Inhibitor
Name:
BDBM75921
Synonyms:
4-[4-chloro-5-(4-methoxyphenoxy)-6-oxo-1-pyridazinyl]benzoic acid ethyl ester SR-02000000451 cid_46835788 ethyl 4-[4-chloro-5-(4-methoxyphenoxy)-6-oxopyridazin-1-yl]benzoate
Type:
Small organic molecule
Emp. Form.:
C20H17ClN2O5
Mol. Mass.:
400.812
SMILES:
CCOC(=O)c1ccc(cc1)-n1ncc(Cl)c(Oc2ccc(OC)cc2)c1=O
: