Target
Melanin-concentrating hormone receptor 1
Ligand
BDBM75922
Substrate
Meas. Tech.
Late-stage fluorescence-based counterscreen for antagonists of the G-protein coupled receptor 7 (GPR7)
IC50
4600±n/a nM
Citation
 PubChem, PC Late-stage fluorescence-based counterscreen for antagonists of the G-protein coupled receptor 7 (GPR7): cell-based dose response assay to identify antagonists of the melanin-concentrating hormone receptor 1 (MCHR1) PubChem Bioassay (2010)[AID] 
Target
Name:
Melanin-concentrating hormone receptor 1
Synonyms:
G-protein coupled receptor 24 MCH receptor 1 MCH-R1 MCHR-1 MCHR1_HUMAN Melanin-Concentrating Hormone Receptor 1 (MCH1R) Melanin-concentrating hormone receptor 1 (MCH-1) Melanin-concentrating hormone receptor 1 (MCHR-1) SLC-1 Somatostatin receptor-like protein
Type:
G Protein-Coupled Receptor (GPCR)
Mol. Mass.:
45976.27
Organism:
Homo sapiens (Human)
Description:
Membranes from CHO-K1 cells stably expressing human MCH1R were used in assays.
Residue:
422
  
Inhibitor
Name:
BDBM75922
Synonyms:
SR-02000000452 [1-(3,4-dichlorobenzyl)-2-piperidyl]-[4-(4-nitrophenyl)piperazino]methanone [1-[(3,4-dichlorophenyl)methyl]piperidin-2-yl]-[4-(4-nitrophenyl)piperazin-1-yl]methanone | cid_46835797
Type:
Small organic molecule
Emp. Form.:
C23H26Cl2N4O3
Mol. Mass.:
477.384
SMILES:
[O-][N+](=O)c1ccc(cc1)N1CCN(CC1)C(=O)C1CCCCN1Cc1ccc(Cl)c(Cl)c1
: