Target
Melanin-concentrating hormone receptor 1
Ligand
BDBM75937
Substrate
Meas. Tech.
Late-stage fluorescence-based counterscreen for antagonists of the G-protein coupled receptor 7 (GPR7)
IC50
10500±n/a nM
Citation
 PubChem, PC Late-stage fluorescence-based counterscreen for antagonists of the G-protein coupled receptor 7 (GPR7): cell-based dose response assay to identify antagonists of the melanin-concentrating hormone receptor 1 (MCHR1) PubChem Bioassay (2010)[AID] 
Target
Name:
Melanin-concentrating hormone receptor 1
Synonyms:
G-protein coupled receptor 24 MCH receptor 1 MCH-R1 MCHR-1 MCHR1_HUMAN Melanin-Concentrating Hormone Receptor 1 (MCH1R) Melanin-concentrating hormone receptor 1 (MCH-1) Melanin-concentrating hormone receptor 1 (MCHR-1) SLC-1 Somatostatin receptor-like protein
Type:
G Protein-Coupled Receptor (GPCR)
Mol. Mass.:
45976.27
Organism:
Homo sapiens (Human)
Description:
Membranes from CHO-K1 cells stably expressing human MCH1R were used in assays.
Residue:
422
  
Inhibitor
Name:
BDBM75937
Synonyms:
5-chloranyl-4-(3,5-dimethoxyphenoxy)-2-(4-propan-2-ylphenyl)pyridazin-3-one 5-chloro-4-(3,5-dimethoxyphenoxy)-2-(4-propan-2-ylphenyl)pyridazin-3-one SR-02000000473 cid_46846319
Type:
Small organic molecule
Emp. Form.:
C21H21ClN2O4
Mol. Mass.:
400.855
SMILES:
COc1cc(OC)cc(Oc2c(Cl)cnn(-c3ccc(cc3)C(C)C)c2=O)c1
: