Target
Neuropeptides B/W receptor type 1
Ligand
BDBM75895
Substrate
Meas. Tech.
Late-stage fluorescence-based dose response cell-based screening assay to identify antagonists of the G-protein coupled receptor 7 (GPR7)
IC50
1000±n/a nM
Citation
 PubChem, PC Late-stage fluorescence-based dose response cell-based screening assay to identify antagonists of the G-protein coupled receptor 7 (GPR7) PubChem Bioassay (2010)[AID] 
Target
Name:
Neuropeptides B/W receptor type 1
Synonyms:
GPR7 NPBWR1 | neuropeptides B/W receptor 1
Type:
Enzyme Catalytic Domain
Mol. Mass.:
36111.82
Organism:
Homo sapiens (Human)
Description:
gi_119607128
Residue:
328
  
Inhibitor
Name:
BDBM75895
Synonyms:
5-chloranyl-2-(4-iodophenyl)-4-(4-methoxyphenoxy)pyridazin-3-one 5-chloro-2-(4-iodophenyl)-4-(4-methoxyphenoxy)pyridazin-3-one SR-02000000366-1 | cid_46172937
Type:
Small organic molecule
Emp. Form.:
C17H12ClIN2O3
Mol. Mass.:
454.646
SMILES:
COc1ccc(Oc2c(Cl)cnn(-c3ccc(I)cc3)c2=O)cc1
: