Target
Neuropeptides B/W receptor type 1
Ligand
BDBM75946
Substrate
Meas. Tech.
Late-stage fluorescence-based dose response cell-based screening assay to identify antagonists of the G-protein coupled receptor 7 (GPR7)
IC50
287±n/a nM
Citation
 PubChem, PC Late-stage fluorescence-based dose response cell-based screening assay to identify antagonists of the G-protein coupled receptor 7 (GPR7) PubChem Bioassay (2010)[AID] 
Target
Name:
Neuropeptides B/W receptor type 1
Synonyms:
GPR7 NPBWR1 | neuropeptides B/W receptor 1
Type:
Enzyme Catalytic Domain
Mol. Mass.:
36111.82
Organism:
Homo sapiens (Human)
Description:
gi_119607128
Residue:
328
  
Inhibitor
Name:
BDBM75946
Synonyms:
2-[3,5-bis(chloranyl)phenyl]-5-chloranyl-4-(4-methoxyphenoxy)pyridazin-3-one 5-chloro-2-(3,5-dichlorophenyl)-4-(4-methoxyphenoxy)pyridazin-3-one SR-02000000482-1 | cid_46850893
Type:
Small organic molecule
Emp. Form.:
C17H11Cl3N2O3
Mol. Mass.:
397.64
SMILES:
COc1ccc(Oc2c(Cl)cnn(-c3cc(Cl)cc(Cl)c3)c2=O)cc1
: