Target
Photoreceptor-specific nuclear receptor
Ligand
BDBM75955
Substrate
Meas. Tech.
TR-FRET-based biochemical high throughput dose response assay to identify NR2E3 inverse agonists
IC50
4423±n/a nM
Citation
 PubChem, PC TR-FRET-based biochemical high throughput dose response assay to identify NR2E3 inverse agonists PubChem Bioassay (2010)[AID] 
Target
Name:
Photoreceptor-specific nuclear receptor
Synonyms:
NR2E3 PNR photoreceptor-specific nuclear receptor
Type:
PROTEIN
Mol. Mass.:
44699.83
Organism:
Homo sapiens (Human)
Description:
ChEMBL_401901
Residue:
410
  
Inhibitor
Name:
BDBM75955
Synonyms:
1-(2,3-Dihydro-indol-1-yl)-2-(5,5-dimethyl-5,6-dihydro-[1,2,4]triazolo[3,4-a]isoquinolin-3-ylsulfanyl)-ethanone 1-(2,3-dihydroindol-1-yl)-2-[(5,5-dimethyl-6H-[1,2,4]triazolo[3,4-a]isoquinolin-3-yl)thio]ethanone MLS000072694 cid_644775
Type:
Small organic molecule
Emp. Form.:
C22H22N4OS
Mol. Mass.:
390.501
SMILES:
CC1(C)Cc2ccccc2-c2nnc(SCC(=O)N3CCc4ccccc34)n12
: