Target
Photoreceptor-specific nuclear receptor
Ligand
BDBM64129
Substrate
Meas. Tech.
TR-FRET-based biochemical high throughput dose response assay to identify NR2E3 inverse agonists
IC50
13925±n/a nM
Citation
 PubChem, PC TR-FRET-based biochemical high throughput dose response assay to identify NR2E3 inverse agonists PubChem Bioassay (2010)[AID] 
Target
Name:
Photoreceptor-specific nuclear receptor
Synonyms:
NR2E3 PNR photoreceptor-specific nuclear receptor
Type:
PROTEIN
Mol. Mass.:
44699.83
Organism:
Homo sapiens (Human)
Description:
ChEMBL_401901
Residue:
410
  
Inhibitor
Name:
BDBM64129
Synonyms:
MLS001202278 N-(2-ethylphenyl)-3-(4-methoxyphenyl)sulfonyl-propionamide N-(2-ethylphenyl)-3-[(4-methoxyphenyl)sulfonyl]propanamide cid_5072004
Type:
Small organic molecule
Emp. Form.:
C18H21NO4S
Mol. Mass.:
347.429
SMILES:
CCc1ccccc1NC(=O)CCS(=O)(=O)c1ccc(OC)cc1
: