Target
Isoform 2 of Nuclear receptor corepressor 2 (TRAC-1)
Ligand
BDBM75978
Substrate
Meas. Tech.
Counterscreen for NR2E3 inverse agonists
IC50
1723±n/a nM
Citation
 PubChem, PC Counterscreen for NR2E3 inverse agonists: TR-FRET-based biochemical high throughput dose response assay to identify inverse agonists of the interaction between peroxisome proliferator-activated receptor gamma (PPARg) and nuclear receptor co-repressor 2 (NCOR2) PubChem Bioassay (2010)[AID] 
Target
Name:
Isoform 2 of Nuclear receptor corepressor 2 (TRAC-1)
Synonyms:
CTG26 NCOR2_HUMAN nuclear receptor corepressor 2 isoform 2
Type:
Enzyme Catalytic Domain
Mol. Mass.:
81401.89
Organism:
Homo sapiens (Human)
Description:
Q9Y618-2 gi_116256445
Residue:
766
  
Inhibitor
Name:
BDBM75978
Synonyms:
3-(2-ketochromen-3-yl)-N-(2-methyl-3-oxazolo[4,5-b]pyridin-2-yl-phenyl)benzamide N-(2-methyl-3-[1,3]oxazolo[4,5-b]pyridin-2-ylphenyl)-3-(2-oxo-2H-chromen-3-yl)benzamide N-[2-methyl-3-([1,3]oxazolo[4,5-b]pyridin-2-yl)phenyl]-3-(2-oxidanylidenechromen-3-yl)benzamide SMR000200182 | cid_2213709
Type:
Small organic molecule
Emp. Form.:
C29H19N3O4
Mol. Mass.:
473.4789
SMILES:
Cc1c(NC(=O)c2cccc(c2)-c2cc3ccccc3oc2=O)cccc1-c1nc2ncccc2o1
: