Target
Isoform 2 of Nuclear receptor corepressor 2 (TRAC-1)
Ligand
BDBM49590
Substrate
Meas. Tech.
Counterscreen for NR2E3 inverse agonists
IC50
4149±n/a nM
Citation
 PubChem, PC Counterscreen for NR2E3 inverse agonists: TR-FRET-based biochemical high throughput dose response assay to identify inverse agonists of the interaction between peroxisome proliferator-activated receptor gamma (PPARg) and nuclear receptor co-repressor 2 (NCOR2) PubChem Bioassay (2010)[AID] 
Target
Name:
Isoform 2 of Nuclear receptor corepressor 2 (TRAC-1)
Synonyms:
CTG26 NCOR2_HUMAN nuclear receptor corepressor 2 isoform 2
Type:
Enzyme Catalytic Domain
Mol. Mass.:
81401.89
Organism:
Homo sapiens (Human)
Description:
Q9Y618-2 gi_116256445
Residue:
766
  
Inhibitor
Name:
BDBM49590
Synonyms:
MLS000548752 N-[4-(cyclopropylsulfamoyl)phenyl]-2-[5-(5,6-dimethyl-1H-benzimidazol-2-yl)pyridin-2-yl]sulfanyl-ethanamide N-[4-(cyclopropylsulfamoyl)phenyl]-2-[[5-(5,6-dimethyl-1H-benzimidazol-2-yl)-2-pyridinyl]thio]acetamide SMR000171161 | cid_3227762
Type:
Small organic molecule
Emp. Form.:
C25H25N5O3S2
Mol. Mass.:
507.628
SMILES:
Cc1cc2nc([nH]c2cc1C)-c1ccc(SCC(=O)Nc2ccc(cc2)S(=O)(=O)NC2CC2)nc1
: