Target
Isoform 2 of Nuclear receptor corepressor 2 (TRAC-1)
Ligand
BDBM75985
Substrate
Meas. Tech.
Counterscreen for NR2E3 inverse agonists
IC50
>39841±n/a nM
Citation
 PubChem, PC Counterscreen for NR2E3 inverse agonists: TR-FRET-based biochemical high throughput dose response assay to identify inverse agonists of the interaction between peroxisome proliferator-activated receptor gamma (PPARg) and nuclear receptor co-repressor 2 (NCOR2) PubChem Bioassay (2010)[AID] 
Target
Name:
Isoform 2 of Nuclear receptor corepressor 2 (TRAC-1)
Synonyms:
CTG26 NCOR2_HUMAN nuclear receptor corepressor 2 isoform 2
Type:
Enzyme Catalytic Domain
Mol. Mass.:
81401.89
Organism:
Homo sapiens (Human)
Description:
Q9Y618-2 gi_116256445
Residue:
766
  
Inhibitor
Name:
BDBM75985
Synonyms:
MLS000389547 N-[2-(cyclohexen-1-yl)ethyl]-2-(4,6,8-trimethylquinolin-2-yl)sulfanyl-ethanamide N-[2-(cyclohexen-1-yl)ethyl]-2-[(4,6,8-trimethyl-2-quinolyl)thio]acetamide cid_2403866
Type:
Small organic molecule
Emp. Form.:
C22H28N2OS
Mol. Mass.:
368.536
SMILES:
Cc1cc(C)c2nc(SCC(=O)NCCC3=CCCCC3)cc(C)c2c1
: