Target
Isoform 2 of Nuclear receptor corepressor 2 (TRAC-1)
Ligand
BDBM75986
Substrate
Meas. Tech.
Counterscreen for NR2E3 inverse agonists
IC50
3994±n/a nM
Citation
 PubChem, PC Counterscreen for NR2E3 inverse agonists: TR-FRET-based biochemical high throughput dose response assay to identify inverse agonists of the interaction between peroxisome proliferator-activated receptor gamma (PPARg) and nuclear receptor co-repressor 2 (NCOR2) PubChem Bioassay (2010)[AID] 
Target
Name:
Isoform 2 of Nuclear receptor corepressor 2 (TRAC-1)
Synonyms:
CTG26 NCOR2_HUMAN nuclear receptor corepressor 2 isoform 2
Type:
Enzyme Catalytic Domain
Mol. Mass.:
81401.89
Organism:
Homo sapiens (Human)
Description:
Q9Y618-2 gi_116256445
Residue:
766
  
Inhibitor
Name:
BDBM75986
Synonyms:
3,4,6-trimethyl-N-(4-sulfamoylbenzyl)coumarilamide 3,4,6-trimethyl-N-[(4-sulfamoylphenyl)methyl]-2-benzofurancarboxamide N-[4-(aminosulfonyl)benzyl]-3,4,6-trimethyl-1-benzofuran-2-carboxamide cid_986536
Type:
Small organic molecule
Emp. Form.:
C19H20N2O4S
Mol. Mass.:
372.438
SMILES:
Cc1c(oc2cc(C)cc(C)c12)C(=O)NCc1ccc(cc1)S(N)(=O)=O
: