Target
Isoform 2 of Nuclear receptor corepressor 2 (TRAC-1)
Ligand
BDBM75991
Substrate
Meas. Tech.
Counterscreen for NR2E3 inverse agonists
IC50
>39849±n/a nM
Citation
 PubChem, PC Counterscreen for NR2E3 inverse agonists: TR-FRET-based biochemical high throughput dose response assay to identify inverse agonists of the interaction between peroxisome proliferator-activated receptor gamma (PPARg) and nuclear receptor co-repressor 2 (NCOR2) PubChem Bioassay (2010)[AID] 
Target
Name:
Isoform 2 of Nuclear receptor corepressor 2 (TRAC-1)
Synonyms:
CTG26 NCOR2_HUMAN nuclear receptor corepressor 2 isoform 2
Type:
Enzyme Catalytic Domain
Mol. Mass.:
81401.89
Organism:
Homo sapiens (Human)
Description:
Q9Y618-2 gi_116256445
Residue:
766
  
Inhibitor
Name:
BDBM75991
Synonyms:
MLS000675021 SMR000313624 | cid_4916091
Type:
Small organic molecule
Emp. Form.:
C16H13F3N2O2S
Mol. Mass.:
354.347
SMILES:
Oc1cc(=O)c2sc3nc(c4CCCCCc4c3c2[nH]1)C(F)(F)F
: