Target
Isoform 2 of Nuclear receptor corepressor 2 (TRAC-1)
Ligand
BDBM54791
Substrate
Meas. Tech.
Counterscreen for NR2E3 inverse agonists
IC50
5059±n/a nM
Citation
 PubChem, PC Counterscreen for NR2E3 inverse agonists: TR-FRET-based biochemical high throughput dose response assay to identify inverse agonists of the interaction between peroxisome proliferator-activated receptor gamma (PPARg) and nuclear receptor co-repressor 2 (NCOR2) PubChem Bioassay (2010)[AID] 
Target
Name:
Isoform 2 of Nuclear receptor corepressor 2 (TRAC-1)
Synonyms:
CTG26 NCOR2_HUMAN nuclear receptor corepressor 2 isoform 2
Type:
Enzyme Catalytic Domain
Mol. Mass.:
81401.89
Organism:
Homo sapiens (Human)
Description:
Q9Y618-2 gi_116256445
Residue:
766
  
Inhibitor
Name:
BDBM54791
Synonyms:
5-chloranyl-2-methoxy-N-[3-([1,2,4]triazolo[4,3-b]pyridazin-6-yl)phenyl]benzamide MLS000685766 cid_7217786
Type:
Small organic molecule
Emp. Form.:
C19H14ClN5O2
Mol. Mass.:
379.8
SMILES:
COc1ccc(Cl)cc1C(=O)Nc1cccc(c1)-c1ccc2nncn2n1
: