Target
Isoform 2 of Nuclear receptor corepressor 2 (TRAC-1)
Ligand
BDBM76025
Substrate
Meas. Tech.
Counterscreen for NR2E3 inverse agonists
IC50
8988±n/a nM
Citation
 PubChem, PC Counterscreen for NR2E3 inverse agonists: TR-FRET-based biochemical high throughput dose response assay to identify inverse agonists of the interaction between peroxisome proliferator-activated receptor gamma (PPARg) and nuclear receptor co-repressor 2 (NCOR2) PubChem Bioassay (2010)[AID] 
Target
Name:
Isoform 2 of Nuclear receptor corepressor 2 (TRAC-1)
Synonyms:
CTG26 NCOR2_HUMAN nuclear receptor corepressor 2 isoform 2
Type:
Enzyme Catalytic Domain
Mol. Mass.:
81401.89
Organism:
Homo sapiens (Human)
Description:
Q9Y618-2 gi_116256445
Residue:
766
  
Inhibitor
Name:
BDBM76025
Synonyms:
2-(4-bromanylphenoxy)-1-(4-pyrimidin-2-ylpiperazin-1-yl)ethanone 2-(4-bromophenoxy)-1-[4-(2-pyrimidinyl)-1-piperazinyl]ethanone MLS002163339 cid_4520271
Type:
Small organic molecule
Emp. Form.:
C16H17BrN4O2
Mol. Mass.:
377.236
SMILES:
Brc1ccc(OCC(=O)N2CCN(CC2)c2ncccn2)cc1
: