Target
Cannabinoid receptor 2
Ligand
BDBM76032
Substrate
Meas. Tech.
SAR analysis of agonists of the Cannabinoid Receptor 2 using an Image-Based Assay - Set 3
EC50
>32000±n/a nM
Citation
 PubChem, PC SAR analysis of agonists of the Cannabinoid Receptor 2 using an Image-Based Assay - Set 3 PubChem Bioassay (2010)[AID] 
Target
Name:
Cannabinoid receptor 2
Synonyms:
CANNABINOID CB2 CB2 CB2B CNR2_HUMAN Cannabinoid CB2 receptor Cannabinoid receptor 2 (CB2R) | hCB2
Type:
G Protein-Coupled Receptor (GPCR)
Mol. Mass.:
39690.94
Organism:
Homo sapiens (Human)
Description:
P34972
Residue:
360
  
Inhibitor
Name:
BDBM76032
Synonyms:
MLS-0437131.0001 cyclohexyl-[4-(2-methyl-5,6,7,8-tetrahydro-[1]benzothiolo[2,3-d]pyrimidin-4-yl)-1-piperazinyl]methanone cyclohexyl-[4-(2-methyl-5,6,7,8-tetrahydrobenzothiopheno[2,3-d]pyrimidin-4-yl)piperazino]methanone
Type:
Small organic molecule
Emp. Form.:
C22H30N4OS
Mol. Mass.:
398.565
SMILES:
Cc1nc(N2CCN(CC2)C(=O)C2CCCCC2)c2c3CCCCc3sc2n1
: