Target
Cannabinoid receptor 2
Ligand
BDBM76060
Substrate
Meas. Tech.
SAR analysis of agonists of the Cannabinoid Receptor 2 using an Image-Based Assay - Set 3
EC50
>32000±n/a nM
Citation
 PubChem, PC SAR analysis of agonists of the Cannabinoid Receptor 2 using an Image-Based Assay - Set 3 PubChem Bioassay (2010)[AID] 
Target
Name:
Cannabinoid receptor 2
Synonyms:
CANNABINOID CB2 CB2 CB2B CNR2_HUMAN Cannabinoid CB2 receptor Cannabinoid receptor 2 (CB2R) | hCB2
Type:
G Protein-Coupled Receptor (GPCR)
Mol. Mass.:
39690.94
Organism:
Homo sapiens (Human)
Description:
P34972
Residue:
360
  
Inhibitor
Name:
BDBM76060
Synonyms:
3-[1-[oxo-(1-phenylcyclopropyl)methyl]-4-piperidinyl]-5-phenyl-1,3,4-oxadiazol-2-one 5-phenyl-3-[1-(1-phenylcyclopropanecarbonyl)piperidin-4-yl]-1,3,4-oxadiazol-2-one MLS-0359128.0001 | cid_23612554
Type:
Small organic molecule
Emp. Form.:
C23H23N3O3
Mol. Mass.:
389.447
SMILES:
O=C(N1CCC(CC1)n1nc(oc1=O)-c1ccccc1)C1(CC1)c1ccccc1
: