Target
Cannabinoid receptor 1
Ligand
BDBM76080
Substrate
Meas. Tech.
SAR analysis of agonists of the Cannabinoid Receptor 1 using an Image-Based Assay - Set 4
EC50
>32000±n/a nM
Citation
 PubChem, PC SAR analysis of agonists of the Cannabinoid Receptor 1 using an Image-Based Assay - Set 4 PubChem Bioassay (2010)[AID] 
Target
Name:
Cannabinoid receptor 1
Synonyms:
CANN6 CB-R CNR CNR1_HUMAN Cannabinoid receptor Cannabinoid receptor 1 (brain)
Type:
G Protein-Coupled Receptor (GPCR)
Mol. Mass.:
52868.96
Organism:
Homo sapiens (Human)
Description:
P21554
Residue:
472
  
Inhibitor
Name:
BDBM76080
Synonyms:
(4Z)-4-[4-(4-bromophenyl)-5-methyl-1,2-dihydropyrazol-3-ylidene]-3-hydroxy-1-cyclohexa-2,5-dienone (4Z)-4-[4-(4-bromophenyl)-5-methyl-1,2-dihydropyrazol-3-ylidene]-3-oxidanyl-cyclohexa-2,5-dien-1-one MLS-0437219.0001 | cid_5415814
Type:
Small organic molecule
Emp. Form.:
C16H13BrN2O2
Mol. Mass.:
345.191
SMILES:
Cc1[nH]nc(c1-c1ccc(Br)cc1)-c1ccc(O)cc1O
: