Target
G-protein coupled receptor 35
Ligand
BDBM76033
Substrate
Meas. Tech.
SAR analysis of Antagonists of the GPR35 Receptor using an Image-Based Assay - Set 6
IC50
>32000±n/a nM
Citation
 PubChem, PC SAR analysis of Antagonists of the GPR35 Receptor using an Image-Based Assay - Set 6 PubChem Bioassay (2010)[AID] 
Target
Name:
G-protein coupled receptor 35
Synonyms:
G protein-coupled receptor 35 GPR35_HUMAN
Type:
Enzyme Catalytic Domain
Mol. Mass.:
34085.57
Organism:
Homo sapiens (Human)
Description:
gi_33695097
Residue:
309
  
Inhibitor
Name:
BDBM76033
Synonyms:
4-(2-methyl-5,6,7,8-tetrahydro-[1]benzothiolo[2,3-d]pyrimidin-4-yl)-N-(phenylmethyl)-1-piperazinecarboxamide MLS-0437132.0001 N-benzyl-4-(2-methyl-5,6,7,8-tetrahydrobenzothiopheno[2,3-d]pyrimidin-4-yl)piperazine-1-carboxamide | cid_1468079
Type:
Small organic molecule
Emp. Form.:
C23H27N5OS
Mol. Mass.:
421.558
SMILES:
Cc1nc(N2CCN(CC2)C(=O)NCc2ccccc2)c2c3CCCCc3sc2n1
: