Target
Cannabinoid receptor 1
Ligand
BDBM57190
Substrate
Meas. Tech.
SAR analysis of antagonists of the Cannabinoid Receptor 1 using an Image-Based Assay - Set 4
IC50
548±n/a nM
Citation
 PubChem, PC SAR analysis of antagonists of the Cannabinoid Receptor 1 using an Image-Based Assay - Set 4 PubChem Bioassay (2010)[AID] 
Target
Name:
Cannabinoid receptor 1
Synonyms:
CANN6 CB-R CNR CNR1_HUMAN Cannabinoid receptor Cannabinoid receptor 1 (brain)
Type:
G Protein-Coupled Receptor (GPCR)
Mol. Mass.:
52868.96
Organism:
Homo sapiens (Human)
Description:
P21554
Residue:
472
  
Inhibitor
Name:
BDBM57190
Synonyms:
(6Z)-6-[4-(4-chlorophenyl)-5-methyl-1,2-dihydropyrazol-3-ylidene]-3-methoxy-1-cyclohexa-2,4-dienone (6Z)-6-[4-(4-chlorophenyl)-5-methyl-1,2-dihydropyrazol-3-ylidene]-3-methoxycyclohexa-2,4-dien-1-one 2-[4-(4-Chloro-phenyl)-5-methyl-1H-pyrazol-3-yl]-5-methoxy-phenol SMR000145663 | cid_5423869
Type:
Small organic molecule
Emp. Form.:
C17H15ClN2O2
Mol. Mass.:
314.766
SMILES:
COc1ccc(-c2n[nH]c(C)c2-c2ccc(Cl)cc2)c(O)c1
: